Reaction Details
TargetPBP2A
LigandBDBM50213259
Substrate/Competitorn/a
Meas. Tech.ChEMBL_153662 (CHEMBL757854)
IC50 3.36e+03±n/a nM
Citation  TBA Bioorg Med Chem Lett5:1427-1432 (1995)  
 
PBP2A
Name:PBP2A
Type:PROTEIN
Mol. Mass.:76283.66
Organism:Staphylococcus aureus
Description:ChEMBL_105733
Residue:668
BDBM50213259
NameBDBM50213259
Synonyms:CHEMBL30991
TypeSmall organic molecule
Emp. Form.C17H15N2NaO7S2
Mol. Mass.446.43
SMILES[Na+].[H][C@]12[C@@H](C)C(Sc3nc4oc(cc4s3)C(=O)OC)=C(N1C(=O)[C@]2([H])[C@@H](C)O)C([O-])=O