Reaction Details
TargetDNA topoisomerase 2-alpha/2-beta
LigandBDBM50212721
Substrate/Competitorn/a
Meas. Tech.ChEMBL_225786 (CHEMBL847692)
EC50 1400±n/a nM
Citation  TBA Bioorg Med Chem Lett5:399-404 (1995)  
 
DNA topoisomerase 2-alpha/2-beta
Name:DNA topoisomerase 2-alpha/2-beta
Synonyms:DNA topoisomerase II
Type:n/a
Mol. Mass.:n/a
Description:ASSAY_ID of ChEMBL is 1821483
Components:This complex has 2 components.
Component 1
Name:DNA topoisomerase 2-alpha
Type:Protein
Mol. Mass.:174415.30
Organism:Homo sapiens (Human)
Description:P11388
Residue:1531
Component 2
Name:DNA topoisomerase 2-beta
Synonyms:DNA topoisomerase II TOP2B | TOP2B_HUMAN
Type:PROTEIN
Mol. Mass.:183284.13
Organism:Homo sapiens (Human)
Description:ChEMBL_51583
Residue:1626
BDBM50212721
NameBDBM50212721
Synonyms:CHEMBL129840
TypeSmall organic molecule
Emp. Form.C19H17F2N3O
Mol. Mass.341.3546
SMILESCc1cc(cc(C)n1)-c1c(F)cc2c(c1F)n(cc\c2=N\O)C1CC1