Reaction Details
TargetMuscarinic acetylcholine receptor M4
LigandBDBM50213288
Substrate/Competitorn/a
Meas. Tech.ChEBML_139257
Ki 537±n/a nM
Citation  TBA Bioorg Med Chem Lett5:785-790 (1995)  
 
Muscarinic acetylcholine receptor M4
Name:Muscarinic acetylcholine receptor M4
Type:Enzyme Catalytic Domain
Mol. Mass.:52841.70
Organism:RAT
Description:Cholinergic, muscarinic M4 CHRM4 RAT::P08485
Residue:477
BDBM50213288
NameBDBM50213288
Synonyms:Spirotramine
TypeSmall organic molecule
Emp. Form.C60H82N4O6
Mol. Mass.955.3163
SMILESCN(CCCCCCCCN(C)CCCCCCN1CCC2(CC1)OC(=O)C(O2)(c1ccccc1)c1ccccc1)CCCCCCN1CCC2(CC1)OC(=O)C(O2)(c1ccccc1)c1ccccc1