Reaction Details
TargetMuscarinic acetylcholine receptor M1
LigandBDBM50213287
Substrate/Competitorn/a
Meas. Tech.ChEBML_139969
Ki 76±n/a nM
Citation  TBA Bioorg Med Chem Lett5:785-790 (1995)  
 
Muscarinic acetylcholine receptor M1
Name:Muscarinic acetylcholine receptor M1
Type:Enzyme Catalytic Domain
Mol. Mass.:51390.46
Organism:RAT
Description:P08482
Residue:460
BDBM50213287
NameBDBM50213287
Synonyms:CHEMBL163901
TypeSmall organic molecule
Emp. Form.C60H86N4O4
Mol. Mass.927.3492
SMILESCN(CCCCCCCCN(C)CCCCCCN1CCC(CC1)OC(=O)C(c1ccccc1)c1ccccc1)CCCCCCN1CCC(CC1)OC(=O)C(c1ccccc1)c1ccccc1