Reaction Details
TargetDNA topoisomerase 2-alpha/2-beta
LigandBDBM50213803
Substrate/Competitorn/a
Meas. Tech.ChEMBL_208606 (CHEMBL812283)
EC50 98±n/a nM
Citation  TBA Bioorg Med Chem Lett5:1021-1026 (1995)  
 
DNA topoisomerase 2-alpha/2-beta
Name:DNA topoisomerase 2-alpha/2-beta
Synonyms:DNA topoisomerase II
Type:n/a
Mol. Mass.:n/a
Description:ASSAY_ID of ChEMBL is 1821483
Components:This complex has 2 components.
Component 1
Name:DNA topoisomerase 2-alpha
Type:Protein
Mol. Mass.:174415.30
Organism:Homo sapiens (Human)
Description:P11388
Residue:1531
Component 2
Name:DNA topoisomerase 2-beta
Synonyms:DNA topoisomerase II TOP2B | TOP2B_HUMAN
Type:PROTEIN
Mol. Mass.:183284.13
Organism:Homo sapiens (Human)
Description:ChEMBL_51583
Residue:1626
BDBM50213803
NameBDBM50213803
Synonyms:CHEMBL428339
TypeSmall organic molecule
Emp. Form.C26H22F2N2O4
Mol. Mass.464.4607
SMILESCc1cc(cc(C)n1)-c1c(F)cc2c(c1F)n(cc(Cc1c(O)cc(O)cc1O)c2=O)C1CC1