Reaction Details
TargetHistamine H2 receptor
LigandBDBM50404032
Substrate/Competitorn/a
Meas. Tech.ChEBML_85064
IC50 4100±n/a nM
Citation  TBA Bioorg Med Chem Lett6:1795-1798 (1996)  
 
Histamine H2 receptor
Name:Histamine H2 receptor
Type:G Protein-Coupled Receptor (GPCR)
Mol. Mass.:40567.22
Organism:Cavia porcellus (domestic guinea pig)
Description:For the H2 receptor-binding assays, guinea pig striatum was used.
Residue:359
BDBM50404032
NameBDBM50404032
Synonyms:ROXATIDINE ACETATE
TypeSmall organic molecule
Emp. Form.C19H28N2O4
Mol. Mass.348.4366
SMILESCC(=O)OCC(=O)NCCCOc1cccc(CN2CCCCC2)c1