Reaction Details
TargetHistamine H2 receptor
LigandBDBM50213880
Substrate/Competitorn/a
Meas. Tech.ChEBML_85064
IC50 1140±n/a nM
Citation  TBA Bioorg Med Chem Lett6:1795-1798 (1996)  
 
Histamine H2 receptor
Name:Histamine H2 receptor
Type:G Protein-Coupled Receptor (GPCR)
Mol. Mass.:40567.22
Organism:Cavia porcellus (domestic guinea pig)
Description:For the H2 receptor-binding assays, guinea pig striatum was used.
Residue:359
BDBM50213880
NameBDBM50213880
Synonyms:CHEMBL50503
TypeSmall organic molecule
Emp. Form.C21H29N3O4S
Mol. Mass.419.538
SMILESCOCC\N=c1/c(O)c(O)c1=NC\C=C/COc1csc(CN2CCCCC2)c1