Reaction Details
Target5-hydroxytryptamine receptor 1D
LigandBDBM50060426
Substrate/Competitorn/a
Meas. Tech.ChEMBL_1955 (CHEMBL617562)
IC50 2±n/a nM
Citation  TBA Bioorg Med Chem Lett6:1825-1830 (1996)  
 
5-hydroxytryptamine receptor 1D
Name:5-hydroxytryptamine receptor 1D
Type:PROTEIN
Mol. Mass.:32680.56
Organism:Sus scrofa
Description:ChEMBL_1963
Residue:291
BDBM50060426
NameBDBM50060426
Synonyms:CHEMBL296161 L-741604
TypeSmall organic molecule
Emp. Form.C14H17N5
Mol. Mass.255.3183
SMILESCN(C)CCc1c[nH]c2ccc(cc12)-n1cnnc1