Reaction Details
Target5-hydroxytryptamine receptor 1D
LigandBDBM50213961
Substrate/Competitorn/a
Meas. Tech.ChEBML_1955
IC50 1.2±n/a nM
Citation  TBA Bioorg Med Chem Lett6:1825-1830 (1996)  
 
5-hydroxytryptamine receptor 1D
Name:5-hydroxytryptamine receptor 1D
Type:PROTEIN
Mol. Mass.:32680.56
Organism:Sus scrofa
Description:ChEMBL_1963
Residue:291
BDBM50213961
NameBDBM50213961
Synonyms:CHEMBL53739
TypeSmall organic molecule
Emp. Form.C16H19N5
Mol. Mass.281.3556
SMILESCN1CCC(CC1)c1c[nH]c2ccc(cc12)-n1cnnc1