Reaction Details
Target5-hydroxytryptamine receptor 2A
LigandBDBM50213961
Substrate/Competitorn/a
Meas. Tech.ChEBML_2582
IC50>10000±n/a nM
Citation  TBA Bioorg Med Chem Lett6:1825-1830 (1996)  
 
5-hydroxytryptamine receptor 2A
Name:5-hydroxytryptamine receptor 2A
Type:G Protein-Coupled Receptor (GPCR)
Mol. Mass.:52852.05
Organism:Rattus norvegicus (rat)
Description:Rat cortex membranes 5-HT2A receptors.
Residue:471
BDBM50213961
NameBDBM50213961
Synonyms:CHEMBL53739
TypeSmall organic molecule
Emp. Form.C16H19N5
Mol. Mass.281.3556
SMILESCN1CCC(CC1)c1c[nH]c2ccc(cc12)-n1cnnc1