Reaction Details
Target5-hydroxytryptamine receptor 2C
LigandBDBM50213961
Substrate/Competitorn/a
Meas. Tech.ChEBML_2788
IC50>10000±n/a nM
Citation  TBA Bioorg Med Chem Lett6:1825-1830 (1996)  
 
5-hydroxytryptamine receptor 2C
Name:5-hydroxytryptamine receptor 2C
Type:G Protein-Coupled Receptor (GPCR)
Mol. Mass.:51836.79
Organism:Homo sapiens (Human)
Description:P28335
Residue:458
BDBM50213961
NameBDBM50213961
Synonyms:CHEMBL53739
TypeSmall organic molecule
Emp. Form.C16H19N5
Mol. Mass.281.3556
SMILESCN1CCC(CC1)c1c[nH]c2ccc(cc12)-n1cnnc1