Reaction Details
Target5-hydroxytryptamine receptor 1D
LigandBDBM50005835
Substrate/Competitorn/a
Meas. Tech.ChEMBL_1954 (CHEMBL617561)
IC50 7.7±n/a nM
Citation  TBA Bioorg Med Chem Lett6:1825-1830 (1996)  
 
5-hydroxytryptamine receptor 1D
Name:5-hydroxytryptamine receptor 1D
Type:PROTEIN
Mol. Mass.:32680.56
Organism:Sus scrofa
Description:ChEMBL_1963
Residue:291
BDBM50005835
NameBDBM50005835
Synonyms:(3-[2-(dimethylamino)ethyl]-1H-indol-5-yl)-N-methylmethanesulfonamide 1-{3-[2-(dimethylamino)ethyl]-1H-indol-5-yl}-N-methylmethanesulfonamide 3-[2-(dimethylamino)ethyl]-N-methylindole-5-methanesulfonamide SUMATRIPTAN Sumax
TypeSmall organic molecule
Emp. Form.C14H21N3O2S
Mol. Mass.295.4
SMILESCNS(=O)(=O)Cc1ccc2[nH]cc(CCN(C)C)c2c1