Reaction Details
TargetDNA topoisomerase 2-alpha/2-beta
LigandBDBM50214148
Substrate/Competitorn/a
Meas. Tech.ChEMBL_208603 (CHEMBL812056)
EC50 3000±n/a nM
Citation  TBA Bioorg Med Chem Lett6:1345-1350 (1996)  
 
DNA topoisomerase 2-alpha/2-beta
Name:DNA topoisomerase 2-alpha/2-beta
Synonyms:DNA topoisomerase II
Type:n/a
Mol. Mass.:n/a
Description:ASSAY_ID of ChEMBL is 1821483
Components:This complex has 2 components.
Component 1
Name:DNA topoisomerase 2-alpha
Type:Protein
Mol. Mass.:174415.30
Organism:Homo sapiens (Human)
Description:P11388
Residue:1531
Component 2
Name:DNA topoisomerase 2-beta
Synonyms:DNA topoisomerase II TOP2B | TOP2B_HUMAN
Type:PROTEIN
Mol. Mass.:183284.13
Organism:Homo sapiens (Human)
Description:ChEMBL_51583
Residue:1626
BDBM50214148
NameBDBM50214148
Synonyms:CHEMBL283395
TypeSmall organic molecule
Emp. Form.C21H27N3O3S2
Mol. Mass.433.587
SMILESCCN(CC)CCNc1ccc(CNS(C)(=O)=O)c2sc3ccccc3c(=O)c12