Reaction Details
Target5-hydroxytryptamine receptor 2C
LigandBDBM50214315
Substrate/Competitorn/a
Meas. Tech.ChEMBL_2856 (CHEMBL617497)
Ki 0.630957±n/a nM
Citation  TBA Bioorg Med Chem Lett6:2687-2692 (1996)  
 
5-hydroxytryptamine receptor 2C
Name:5-hydroxytryptamine receptor 2C
Type:Enzyme
Mol. Mass.:51935.10
Organism:Rattus norvegicus (Rat)
Description:P08909
Residue:460
BDBM50214315
NameBDBM50214315
Synonyms:CHEMBL90709
TypeSmall organic molecule
Emp. Form.C20H26ClN3O5
Mol. Mass.423.891
SMILESCOc1cc(OC)c(cc1Cl)C(=O)CCCCN1CCC2(CC1)NC(=O)NC2=O