Reaction Details
Target5-hydroxytryptamine receptor 3A
LigandBDBM50214493
Substrate/Competitorn/a
Meas. Tech.ChEBML_3475
Ki 602±n/a nM
Citation  TBA Bioorg Med Chem Lett6:477-480 (1996)  
 
5-hydroxytryptamine receptor 3A
Name:5-hydroxytryptamine receptor 3A
Type:Protein
Mol. Mass.:55283.27
Organism:Homo sapiens (Human)
Description:P46098
Residue:478
BDBM50214493
NameBDBM50214493
Synonyms:CHEMBL145033 | RS-16456
TypeSmall organic molecule
Emp. Form.C18H23ClN4O
Mol. Mass.346.854
SMILESCC(C)n1cnc2c(cc(Cl)cc12)C(=O)N[C@@H]1CN2CCC1CC2