Reaction Details
Target5-hydroxytryptamine receptor 4
LigandBDBM50214492
Substrate/Competitorn/a
Meas. Tech.ChEBML_3293
Ki 24±n/a nM
Citation  TBA Bioorg Med Chem Lett6:477-480 (1996)  
 
5-hydroxytryptamine receptor 4
Name:5-hydroxytryptamine receptor 4
Type:Enzyme Catalytic Domain
Mol. Mass.:43735.29
Organism:GUINEA PIG
Description:5-HT4 HTR4 GUINEA PIG::O70528
Residue:388
BDBM50214492
NameBDBM50214492
Synonyms:CHEMBL145725 | RS-16566
TypeSmall organic molecule
Emp. Form.C18H23ClN4O
Mol. Mass.346.854
SMILESCC(C)n1cnc2c(cc(Cl)cc12)C(=O)N[C@H]1CN2CCC1CC2