Reaction Details
Target5-hydroxytryptamine receptor 3A
LigandBDBM50214494
Substrate/Competitorn/a
Meas. Tech.ChEBML_3475
Ki 20±n/a nM
Citation  TBA Bioorg Med Chem Lett6:477-480 (1996)  
 
5-hydroxytryptamine receptor 3A
Name:5-hydroxytryptamine receptor 3A
Type:Protein
Mol. Mass.:55283.27
Organism:Homo sapiens (Human)
Description:P46098
Residue:478
BDBM50214494
NameBDBM50214494
Synonyms:CHEMBL142852 | RS-33800
TypeSmall organic molecule
Emp. Form.C19H25ClN4O
Mol. Mass.360.881
SMILESCC(C)n1cnc2c(cc(Cl)cc12)C(=O)NC1CC2CCC(C1)N2C