Reaction Details
TargetSubstance-P receptor
LigandBDBM50212402
Substrate/Competitorn/a
Meas. Tech.ChEMBL_143039 (CHEMBL750288)
Ki 0.079433±n/a nM
Citation  TBA Bioorg Med Chem Lett6:1015-1020 (1996)  
 
Substance-P receptor
Name:Substance-P receptor
Type:G Protein-Coupled Receptor (GPCR)
Mol. Mass.:46254.43
Organism:Homo sapiens (Human)
Description:P25103
Residue:407
BDBM50212402
NameBDBM50212402
Synonyms:CHEMBL558990
TypeSmall organic molecule
Emp. Form.C23H30Cl2N6O
Mol. Mass.477.43
SMILESCl.Cl.COc1ccc(cc1CN[C@H]1CCCN[C@H]1c1ccccc1)-n1nnnc1C1CC1