Reaction Details
TargetType-1 angiotensin II receptor B
LigandBDBM50214847
Substrate/Competitorn/a
Meas. Tech.ChEMBL_36487 (CHEMBL856951)
Ki 2.0±n/a nM
Citation  TBA Bioorg Med Chem Lett7:385-388 (1997)  
 
Type-1 angiotensin II receptor B
Name:Type-1 angiotensin II receptor B
Type:Enzyme Catalytic Domain
Mol. Mass.:40929.44
Organism:RAT
Description:Angiotensin II AT1B 0 RAT::P29089
Residue:359
BDBM50214847
NameBDBM50214847
Synonyms:CHEMBL340863
TypeSmall organic molecule
Emp. Form.C27H23N7O3S
Mol. Mass.525.582
SMILESCCCc1nn(Cc2ccc(cc2)-c2ccccc2-c2nn[nH]n2)\c(=N\C(=O)c2ccccc2C(O)=O)s1