Reaction Details
TargetType-1 angiotensin II receptor B
LigandBDBM50215030
Substrate/Competitorn/a
Meas. Tech.ChEMBL_36487 (CHEMBL856951)
Ki 2.5±n/a nM
Citation  TBA Bioorg Med Chem Lett7:385-388 (1997)  
 
Type-1 angiotensin II receptor B
Name:Type-1 angiotensin II receptor B
Type:Enzyme Catalytic Domain
Mol. Mass.:40929.44
Organism:RAT
Description:Angiotensin II AT1B 0 RAT::P29089
Residue:359
BDBM50215030
NameBDBM50215030
Synonyms:CHEMBL340618
TypeSmall organic molecule
Emp. Form.C26H23N7O2S
Mol. Mass.497.572
SMILESCCc1nn(Cc2ccc(cc2)-c2ccccc2-c2nn[nH]n2)\c(=N\C(=O)c2ccccc2OC)s1