Reaction Details
Target[Pyruvate dehydrogenase (acetyl-transferring)] kinase isozyme 1,/2,/3,/4, mitochondrial
LigandBDBM50217007
Substrate/Competitorn/a
Meas. Tech.ChEMBL_160230 (CHEMBL764813)
IC50 9500±n/a nM
Citation Aicher, TDDamon, REKoletar, JVinluan, CCBrand, LJGao, JShetty, SSKaplan, ELMann, WR Triterpene and diterpene inhibitors of pyruvate dehydrogenase kinase (PDK). Bioorg Med Chem Lett9:2223-8 (1999) [Pyruvate dehydrogenase (acetyl-transferring)] kinase isozyme 1,/2,/3,/4, mitochondrial
Name:[Pyruvate dehydrogenase (acetyl-transferring)] kinase isozyme 1,/2,/3,/4, mitochondrial
Synonyms:Pyruvate dehydrogenase kinase
Type:n/a
Mol. Mass.:n/a
Description:ASSAY_ID of ChEMBL is 160230
Components:This complex has 4 components.
Component 1
Name:[Pyruvate dehydrogenase (acetyl-transferring)] kinase isozyme 1, mitochondrial
Type:Protein
Mol. Mass.:49255.23
Organism:Homo sapiens (Human)
Description:Q15118
Residue:436
Component 2
Name:[Pyruvate dehydrogenase (acetyl-transferring)] kinase isozyme 4, mitochondrial
Synonyms:PDHK4 PDK4_HUMAN Pyruvate dehydrogenase kinase 4 (PDK4) | Pyruvate dehydrogenase kinase isoform 4
Type:Enzyme
Mol. Mass.:46469.71
Organism:Homo sapiens (Human)
Description:Q16654
Residue:411
Component 3
Name:[Pyruvate dehydrogenase (acetyl-transferring)] kinase isozyme 2, mitochondrial
Synonyms:PDHK2 PDK2_HUMAN Pyruvate dehydrogenase kinase isoenzyme 1 (PDK2)
Type:Enzyme
Mol. Mass.:46153.78
Organism:Homo sapiens (Human)
Description:Q15119
Residue:407
Component 4
Name:[Pyruvate dehydrogenase (acetyl-transferring)] kinase isozyme 3, mitochondrial
Synonyms:PDHK3 PDK3_HUMAN Pyruvate dehydrogenase kinase 3 (PDK3) [Pyruvate dehydrogenase (acetyl-transferring)] kinase isozyme 3, mitochondrial
Type:Enzyme
Mol. Mass.:46944.89
Organism:Homo sapiens (Human)
Description:Q15120
Residue:406
BDBM50217007
NameBDBM50217007
Synonyms:CHEMBL70488
TypeSmall organic molecule
Emp. Form.C20H31N
Mol. Mass.285.4668
SMILES[H][C@@]12CCc3cc(ccc3[C@@]1(C)CCC[C@@]2(C)CN)C(C)C