Reaction Details
TargetSimilar to alpha-tubulin isoform 1
LigandBDBM50217336
Substrate/Competitorn/a
Meas. Tech.ChEMBL_225815 (CHEMBL844431)
IC50 11800±n/a nM
Citation Miller, TABulman, ALThompson, CDMacdonald, TL The synthesis and evaluation of temperature sensitive tubulin toxins. Bioorg Med Chem Lett9:407-12 (1999) Similar to alpha-tubulin isoform 1
Name:Similar to alpha-tubulin isoform 1
Synonyms:Similar to alpha-tubulin isoform 1
Type:PROTEIN
Mol. Mass.:10383.05
Organism:Bos taurus
Description:ChEMBL_104716
Residue:99
BDBM50217336
NameBDBM50217336
Synonyms:CHEMBL131684
TypeSmall organic molecule
Emp. Form.C19H22O5
Mol. Mass.330.375
SMILESCOc1ccc(cc1O)C1CCc2cc(OC)c(OC)c(OC)c12