Reaction Details
TargetPBP2A
LigandBDBM50217406
Substrate/Competitorn/a
Meas. Tech.ChEBML_153664
IC50 1.6±n/a nM
Citation Wilkening, RRRatcliffe, RWWildonger, KJCama, LDDykstra, KDDiNinno, FPBlizzard, TAHammond, MLHeck, JVDorso, KLSt Rose, EKohler, JHammond, GG Synthesis and activity of 2-(sulfonamido)methyl-carbapenems: discovery of a novel, anti-MRSA 1,8-naphthosultam pharmacophore. Bioorg Med Chem Lett9:673-8 (1999) PBP2A
Name:PBP2A
Type:PROTEIN
Mol. Mass.:76283.66
Organism:Staphylococcus aureus
Description:ChEMBL_105733
Residue:668
BDBM50217406
NameBDBM50217406
Synonyms:CHEMBL351921
TypeSmall organic molecule
Emp. Form.C22H19N2NaO7S
Mol. Mass.478.45
SMILES[Na+].[H][C@]12[C@@H](C)C(CN3C(=O)c4c(ccc5ccccc45)S3(=O)=O)=C(N1C(=O)[C@]2([H])[C@@H](C)O)C([O-])=O