Reaction Details
Target5-hydroxytryptamine receptor 2C
LigandBDBM50217968
Substrate/Competitorn/a
Meas. Tech.ChEBML_2760
Ki 1.6±n/a nM
Citation Bromidge, SMDabbs, SDavies, SDuckworth, DMForbes, ITJones, GEJones, JKing, FDSaunders, DVBlackburn, TPHolland, VKennett, GALightowler, SMiddlemiss, DNRiley, GJTrail, BWood, MD 1-[2-[(Heteroaryloxy)heteroaryl]carbamoyl]indolines: novel and selective 5-HT2C receptor inverse agonists with potential as antidepressant/anxiolytic agents. Bioorg Med Chem Lett10:1863-6 (2000) 5-hydroxytryptamine receptor 2C
Name:5-hydroxytryptamine receptor 2C
Type:G Protein-Coupled Receptor (GPCR)
Mol. Mass.:51836.79
Organism:Homo sapiens (Human)
Description:P28335
Residue:458
BDBM50217968
NameBDBM50217968
Synonyms:CHEMBL55472
TypeSmall organic molecule
Emp. Form.C23H23ClN4O2
Mol. Mass.422.907
SMILESCCCc1ncccc1Oc1ccc(NC(=O)N2CCc3cc(C)c(Cl)cc23)cn1