Reaction Details
Target5-hydroxytryptamine receptor 2A
LigandBDBM50217991
Substrate/Competitorn/a
Meas. Tech.ChEMBL_2529 (CHEMBL616879)
Ki 126±n/a nM
Citation Bromidge, SMDabbs, SDavies, SDuckworth, DMForbes, ITJones, GEJones, JKing, FDSaunders, DVBlackburn, TPHolland, VKennett, GALightowler, SMiddlemiss, DNRiley, GJTrail, BWood, MD 1-[2-[(Heteroaryloxy)heteroaryl]carbamoyl]indolines: novel and selective 5-HT2C receptor inverse agonists with potential as antidepressant/anxiolytic agents. Bioorg Med Chem Lett10:1863-6 (2000) 5-hydroxytryptamine receptor 2A
Name:5-hydroxytryptamine receptor 2A
Type:undefined
Mol. Mass.:52607.65
Organism:Homo sapiens (Human)
Description:P28223
Residue:471
BDBM50217991
NameBDBM50217991
Synonyms:CHEMBL301012
TypeSmall organic molecule
Emp. Form.C21H18Cl2N4O2
Mol. Mass.429.299
SMILESCc1cc2CCN(C(=O)Nc3cnc(Oc4cccnc4C)c(Cl)c3)c2cc1Cl