Reaction Details
Target5-hydroxytryptamine receptor 2B
LigandBDBM50217975
Substrate/Competitorn/a
Meas. Tech.ChEMBL_2884 (CHEMBL617786)
Ki 13±n/a nM
Citation Bromidge, SMDabbs, SDavies, SDuckworth, DMForbes, ITJones, GEJones, JKing, FDSaunders, DVBlackburn, TPHolland, VKennett, GALightowler, SMiddlemiss, DNRiley, GJTrail, BWood, MD 1-[2-[(Heteroaryloxy)heteroaryl]carbamoyl]indolines: novel and selective 5-HT2C receptor inverse agonists with potential as antidepressant/anxiolytic agents. Bioorg Med Chem Lett10:1863-6 (2000) 5-hydroxytryptamine receptor 2B
Name:5-hydroxytryptamine receptor 2B
Type:G Protein-Coupled Receptor (GPCR)
Mol. Mass.:54312.47
Organism:Homo sapiens (Human)
Description:Receptor binding assays were performed using human clone stably expressed in CHO cells.
Residue:481
BDBM50217975
NameBDBM50217975
Synonyms:CHEMBL299938
TypeSmall organic molecule
Emp. Form.C21H18F3N5O2
Mol. Mass.429.3951
SMILESCc1cc2CCN(C(=O)Nc3ccc(Oc4cncnc4C)nc3)c2cc1C(F)(F)F