Reaction Details
Target5-hydroxytryptamine receptor 2C
LigandBDBM50086065
Substrate/Competitorn/a
Meas. Tech.ChEMBL_2760 (CHEMBL617757)
Ki 1±n/a nM
Citation Bromidge, SMDabbs, SDavies, SDuckworth, DMForbes, ITJones, GEJones, JKing, FDSaunders, DVBlackburn, TPHolland, VKennett, GALightowler, SMiddlemiss, DNRiley, GJTrail, BWood, MD 1-[2-[(Heteroaryloxy)heteroaryl]carbamoyl]indolines: novel and selective 5-HT2C receptor inverse agonists with potential as antidepressant/anxiolytic agents. Bioorg Med Chem Lett10:1863-6 (2000) 5-hydroxytryptamine receptor 2C
Name:5-hydroxytryptamine receptor 2C
Type:G Protein-Coupled Receptor (GPCR)
Mol. Mass.:51836.79
Organism:Homo sapiens (Human)
Description:P28335
Residue:458
BDBM50086065
NameBDBM50086065
Synonyms:5-Methyl-6-trifluoromethyl-2,3-dihydro-indole-1-carboxylic acid [6-(2-methyl-pyridin-3-yloxy)-pyridin-3-yl]-amide CHEMBL14460 | SB-243213
TypeSmall organic molecule
Emp. Form.C22H19F3N4O2
Mol. Mass.428.4071
SMILESCc1cc2CCN(C(=O)Nc3ccc(Oc4cccnc4C)nc3)c2cc1C(F)(F)F