Reaction Details
TargetEstrogen receptor beta
LigandBDBM50218326
Substrate/Competitorn/a
Meas. Tech.ChEMBL_66406 (CHEMBL677100)
IC50 30±n/a nM
Citation Jørgensen, ASJacobsen, PChristiansen, LBBury, PSKanstrup, AThorpe, SMNaerum, LWassermann, K Synthesis and estrogen receptor binding affinities of novel pyrrolo[2,1,5-cd]indolizine derivatives. Bioorg Med Chem Lett10:2383-6 (2000) Estrogen receptor beta
Name:Estrogen receptor beta
Synonyms:Estrogen receptor
Type:n/a
Mol. Mass.:n/a
Description:ASSAY_ID of ChEMBL is 99778
Components:This complex has 2 components.
Component 1
Name:Estrogen receptor beta
Type:Protein
Mol. Mass.:59238.43
Organism:Homo sapiens (Human)
Description:Q92731
Residue:530
Component 2
Name:Estrogen receptor
Synonyms:ER ESR ESR1_HUMAN Estrogen receptor Estrogen receptor (ER-alpha) Estrogen receptor alpha (ER) Nuclear receptor subfamily 3 group A member 1
Type:Protein
Mol. Mass.:66230.44
Organism:Homo sapiens (Human)
Description:P03372
Residue:595
BDBM50218326
NameBDBM50218326
Synonyms:CHEMBL80560
TypeSmall organic molecule
Emp. Form.C19H17NO
Mol. Mass.275.3444
SMILESOc1ccc(cc1)C1=c2ccc3=CC=C4CCCC1C4n23