Reaction Details
TargetEstrogen receptor beta
LigandBDBM50218329
Substrate/Competitorn/a
Meas. Tech.ChEMBL_66406 (CHEMBL677100)
IC50 200±n/a nM
Citation Jørgensen, ASJacobsen, PChristiansen, LBBury, PSKanstrup, AThorpe, SMNaerum, LWassermann, K Synthesis and estrogen receptor binding affinities of novel pyrrolo[2,1,5-cd]indolizine derivatives. Bioorg Med Chem Lett10:2383-6 (2000) Estrogen receptor beta
Name:Estrogen receptor beta
Synonyms:Estrogen receptor
Type:n/a
Mol. Mass.:n/a
Description:ASSAY_ID of ChEMBL is 99778
Components:This complex has 2 components.
Component 1
Name:Estrogen receptor beta
Type:Protein
Mol. Mass.:59238.43
Organism:Homo sapiens (Human)
Description:Q92731
Residue:530
Component 2
Name:Estrogen receptor
Synonyms:ER ESR ESR1_HUMAN Estrogen receptor Estrogen receptor (ER-alpha) Estrogen receptor alpha (ER) Nuclear receptor subfamily 3 group A member 1
Type:Protein
Mol. Mass.:66230.44
Organism:Homo sapiens (Human)
Description:P03372
Residue:595
BDBM50218329
NameBDBM50218329
Synonyms:CHEMBL78526
TypeSmall organic molecule
Emp. Form.C20H21NO
Mol. Mass.291.3868
SMILESCCCCC1C2C=CC=c3ccc(=C1c1ccc(O)cc1)n23