Reaction Details
TargetEstrogen receptor beta
LigandBDBM50218331
Substrate/Competitorn/a
Meas. Tech.ChEMBL_66406 (CHEMBL677100)
IC50 180±n/a nM
Citation Jørgensen, ASJacobsen, PChristiansen, LBBury, PSKanstrup, AThorpe, SMNaerum, LWassermann, K Synthesis and estrogen receptor binding affinities of novel pyrrolo[2,1,5-cd]indolizine derivatives. Bioorg Med Chem Lett10:2383-6 (2000) Estrogen receptor beta
Name:Estrogen receptor beta
Synonyms:Estrogen receptor
Type:n/a
Mol. Mass.:n/a
Description:ASSAY_ID of ChEMBL is 99778
Components:This complex has 2 components.
Component 1
Name:Estrogen receptor beta
Type:Protein
Mol. Mass.:59238.43
Organism:Homo sapiens (Human)
Description:Q92731
Residue:530
Component 2
Name:Estrogen receptor
Synonyms:ER ESR ESR1_HUMAN Estrogen receptor Estrogen receptor (ER-alpha) Estrogen receptor alpha (ER) Nuclear receptor subfamily 3 group A member 1
Type:Protein
Mol. Mass.:66230.44
Organism:Homo sapiens (Human)
Description:P03372
Residue:595
BDBM50218331
NameBDBM50218331
Synonyms:CHEMBL308754
TypeSmall organic molecule
Emp. Form.C18H15NO
Mol. Mass.261.3178
SMILESCCc1c(-c2ccccc2)c2ccc3c(O)ccc1n23