Reaction Details
TargetEstrogen receptor beta
LigandBDBM50085657
Substrate/Competitorn/a
Meas. Tech.ChEMBL_66407 (CHEMBL677101)
IC50 9.5±n/a nM
Citation Jørgensen, ASJacobsen, PChristiansen, LBBury, PSKanstrup, AThorpe, SMBain, SNaerum, LWassermann, K Synthesis and pharmacology of a novel pyrrolo[2,1,5-cd] indolizine (NNC 45-0095), a high affinity non-steroidal agonist for the estrogen receptor. Bioorg Med Chem Lett10:399-402 (2000) Estrogen receptor beta
Name:Estrogen receptor beta
Synonyms:Estrogen receptor
Type:n/a
Mol. Mass.:n/a
Description:ASSAY_ID of ChEMBL is 99778
Components:This complex has 2 components.
Component 1
Name:Estrogen receptor beta
Type:Protein
Mol. Mass.:59238.43
Organism:Homo sapiens (Human)
Description:Q92731
Residue:530
Component 2
Name:Estrogen receptor
Synonyms:ER ESR ESR1_HUMAN Estrogen receptor Estrogen receptor (ER-alpha) Estrogen receptor alpha (ER) Nuclear receptor subfamily 3 group A member 1
Type:Protein
Mol. Mass.:66230.44
Organism:Homo sapiens (Human)
Description:P03372
Residue:595
BDBM50085657
NameBDBM50085657
Synonyms:4-(1-Ethyl-pyrrolo[2,1,5-cd]indolizin-2-yl)-phenol | CHEMBL420017
TypeSmall organic molecule
Emp. Form.C18H15NO
Mol. Mass.261.3178
SMILESCCc1c(-c2ccc(O)cc2)c2ccc3cccc1n23