Reaction Details
TargetEstrogen receptor beta
LigandBDBM50085657
Substrate/Competitorn/a
Meas. Tech.ChEMBL_125044 (CHEMBL731554)
EC50 0.960000±n/a nM
Citation Jørgensen, ASJacobsen, PChristiansen, LBBury, PSKanstrup, AThorpe, SMBain, SNaerum, LWassermann, K Synthesis and pharmacology of a novel pyrrolo[2,1,5-cd] indolizine (NNC 45-0095), a high affinity non-steroidal agonist for the estrogen receptor. Bioorg Med Chem Lett10:399-402 (2000) Estrogen receptor beta
Name:Estrogen receptor beta
Synonyms:Estrogen receptor
Type:n/a
Mol. Mass.:n/a
Description:ASSAY_ID of ChEMBL is 125044
Components:This complex has 2 components.
Component 1
Name:Estrogen receptor
Type:PROTEIN
Mol. Mass.:66969.87
Organism:Mus musculus
Description:ChEMBL_648798
Residue:599
Component 2
Name:Estrogen receptor beta
Synonyms:ER-beta Esr2 Estrb Estrogen receptor beta Nuclear receptor subfamily 3 group A member 2
Type:PROTEIN
Mol. Mass.:59091.81
Organism:Mus musculus
Description:ChEMBL_306448
Residue:530
BDBM50085657
NameBDBM50085657
Synonyms:4-(1-Ethyl-pyrrolo[2,1,5-cd]indolizin-2-yl)-phenol | CHEMBL420017
TypeSmall organic molecule
Emp. Form.C18H15NO
Mol. Mass.261.3178
SMILESCCc1c(-c2ccc(O)cc2)c2ccc3cccc1n23