Reaction Details
TargetcAMP-specific 3',5'-cyclic phosphodiesterase 4A/4B/4C/4D
LigandBDBM50218582
Substrate/Competitorn/a
Meas. Tech.ChEBML_156918
IC50 4±n/a nM
Citation Napoletano, MNorcini, GPellacini, FMarchini, FMorazzoni, GFerlenga, PPradella, L Phthalazine PDE4 inhibitors. Part 2: the synthesis and biological evaluation of 6-methoxy-1,4-disubstituted derivatives. Bioorg Med Chem Lett11:33-7 (2001) cAMP-specific 3',5'-cyclic phosphodiesterase 4A/4B/4C/4D
Name:cAMP-specific 3',5'-cyclic phosphodiesterase 4A/4B/4C/4D
Synonyms:Phosphodiesterase 4
Type:n/a
Mol. Mass.:n/a
Description:ASSAY_ID of ChEMBL is 788178
Components:This complex has 4 components.
Component 1
Name:cAMP-specific 3',5'-cyclic phosphodiesterase 4A
Type:Enzyme
Mol. Mass.:98113.27
Organism:Homo sapiens (Human)
Description:P27815
Residue:886
Component 2
Name:cAMP-specific 3',5'-cyclic phosphodiesterase 4D
Synonyms:3',5'-cyclic phosphodiesterase PDE43 PDE4D_HUMAN | Phosphodiesterase 4D
Type:Protein
Mol. Mass.:91092.69
Organism:Homo sapiens (Human)
Description:Q08499
Residue:809
Component 3
Name:cAMP-specific 3',5'-cyclic phosphodiesterase 4B
Synonyms:3',5'-cyclic phosphodiesterase Isoform PDE4B1 PDE4B PDE4B_HUMAN Phosphodiesterase 4B (PDE4B) Phosphodiesterase Type 4 (PDE4B)
Type:Protein
Mol. Mass.:83318.87
Organism:Homo sapiens (Human)
Description:Q07343
Residue:736
Component 4
Name:cAMP-specific 3',5'-cyclic phosphodiesterase 4C
Synonyms:3',5'-cyclic phosphodiesterase NP_000914.2 PDE4C | PDE4C1
Type:Enzyme Catalytic Domain
Mol. Mass.:79875.54
Organism:Homo sapiens (Human)
Description:Q08493
Residue:712
BDBM50218582
NameBDBM50218582
Synonyms:CHEMBL123993
TypeSmall organic molecule
Emp. Form.C33H44N6O11S
Mol. Mass.732.801
SMILESNC(=N)N1CCC[C@H](NC(=O)C2CC3CCC(O)CC3N2C(=O)[C@@H](Cc2ccc(O)cc2)NC(=O)[C@H](O)Cc2ccc(OS(O)(=O)=O)cc2)C1O