Reaction Details
Target5-hydroxytryptamine receptor 6
LigandBDBM50219095
Substrate/Competitorn/a
Meas. Tech.ChEMBL_3633 (CHEMBL619951)
Ki 2.0±n/a nM
Citation Bromidge, SMGriffith, KHeightman, TDJennings, AKing, FDMoss, SFNewman, HRiley, GRoutledge, CSerafinowska, HTThomas, DR Novel (4-piperazin-1-ylquinolin-6-yl) arylsulfonamides with high affinity and selectivity for the 5-HT(6) receptor. Bioorg Med Chem Lett11:2843-6 (2001) 5-hydroxytryptamine receptor 6
Name:5-hydroxytryptamine receptor 6
Type:G Protein-Coupled Receptor (GPCR)
Mol. Mass.:46968.43
Organism:Homo sapiens (Human)
Description:P50406
Residue:440
BDBM50219095
NameBDBM50219095
Synonyms:CHEMBL94988
TypeSmall organic molecule
Emp. Form.C25H25ClN4O2S2
Mol. Mass.513.075
SMILES[H][C@@]12CCCN1CCN(C2)c1ccnc2ccc(NS(=O)(=O)c3sc4ccc(Cl)cc4c3C)cc12