Reaction Details
Target5-hydroxytryptamine receptor 6
LigandBDBM50219087
Substrate/Competitorn/a
Meas. Tech.ChEMBL_3634 (CHEMBL619952)
Ki 0.501187±n/a nM
Citation Bromidge, SMGriffith, KHeightman, TDJennings, AKing, FDMoss, SFNewman, HRiley, GRoutledge, CSerafinowska, HTThomas, DR Novel (4-piperazin-1-ylquinolin-6-yl) arylsulfonamides with high affinity and selectivity for the 5-HT(6) receptor. Bioorg Med Chem Lett11:2843-6 (2001) 5-hydroxytryptamine receptor 6
Name:5-hydroxytryptamine receptor 6
Type:G Protein-Coupled Receptor (GPCR)
Mol. Mass.:46968.43
Organism:Homo sapiens (Human)
Description:P50406
Residue:440
BDBM50219087
NameBDBM50219087
Synonyms:CHEMBL97637
TypeSmall organic molecule
Emp. Form.C25H24N4O2S
Mol. Mass.444.549
SMILESO=S(=O)(Nc1ccc2nccc(N3CCNCC3)c2c1)c1ccc(cc1)-c1ccccc1