Reaction Details
TargetEstrogen receptor beta
LigandBDBM50219398
Substrate/Competitorn/a
Meas. Tech.ChEMBL_66405 (CHEMBL677099)
IC50 73±n/a nM
Citation Christiansen, LBWenckens, MBury, PSGissel, BHansen, BSThorpe, SMJacobsen, PKanstrup, AJørgensen, ASNaerum, LWassermann, K Synthesis and biological evaluation of novel thio-substituted chromanes as high-affinity partial agonists for the estrogen receptor. Bioorg Med Chem Lett12:17-9 (2002) Estrogen receptor beta
Name:Estrogen receptor beta
Synonyms:Estrogen receptor
Type:n/a
Mol. Mass.:n/a
Description:ASSAY_ID of ChEMBL is 99778
Components:This complex has 2 components.
Component 1
Name:Estrogen receptor beta
Type:Protein
Mol. Mass.:59238.43
Organism:Homo sapiens (Human)
Description:Q92731
Residue:530
Component 2
Name:Estrogen receptor
Synonyms:ER ESR ESR1_HUMAN Estrogen receptor Estrogen receptor (ER-alpha) Estrogen receptor alpha (ER) Nuclear receptor subfamily 3 group A member 1
Type:Protein
Mol. Mass.:66230.44
Organism:Homo sapiens (Human)
Description:P03372
Residue:595
BDBM50219398
NameBDBM50219398
Synonyms:Levormeloxifene
TypeSmall organic molecule
Emp. Form.C30H35NO3
Mol. Mass.457.6038
SMILESCOc1ccc2[C@H]([C@H](c3ccccc3)C(C)(C)Oc2c1)c1ccc(OCCN2CCCC2)cc1