Reaction Details
TargetEstrogen receptor beta
LigandBDBM50219400
Substrate/Competitorn/a
Meas. Tech.ChEMBL_66405 (CHEMBL677099)
IC50 6.5±n/a nM
Citation Christiansen, LBWenckens, MBury, PSGissel, BHansen, BSThorpe, SMJacobsen, PKanstrup, AJørgensen, ASNaerum, LWassermann, K Synthesis and biological evaluation of novel thio-substituted chromanes as high-affinity partial agonists for the estrogen receptor. Bioorg Med Chem Lett12:17-9 (2002) Estrogen receptor beta
Name:Estrogen receptor beta
Synonyms:Estrogen receptor
Type:n/a
Mol. Mass.:n/a
Description:ASSAY_ID of ChEMBL is 99778
Components:This complex has 2 components.
Component 1
Name:Estrogen receptor beta
Type:Protein
Mol. Mass.:59238.43
Organism:Homo sapiens (Human)
Description:Q92731
Residue:530
Component 2
Name:Estrogen receptor
Synonyms:ER ESR ESR1_HUMAN Estrogen receptor Estrogen receptor (ER-alpha) Estrogen receptor alpha (ER) Nuclear receptor subfamily 3 group A member 1
Type:Protein
Mol. Mass.:66230.44
Organism:Homo sapiens (Human)
Description:P03372
Residue:595
BDBM50219400
NameBDBM50219400
Synonyms:CHEMBL554789
TypeSmall organic molecule
Emp. Form.C27H30ClNO2S
Mol. Mass.468.051
SMILESCl.Oc1ccc2[C@H]([C@H](COc2c1)c1ccccc1)c1ccc(SCCN2CCCC2)cc1