Reaction Details
Target5-hydroxytryptamine receptor 1F
LigandBDBM50001824
Substrate/Competitorn/a
Meas. Tech.ChEMBL_2096 (CHEMBL617132)
Ki 200±n/a nM
Citation Bromidge, SMClarke, SEKing, FDLovell, PJNewman, HRiley, GRoutledge, CSerafinowska, HTSmith, DRThomas, DR Bicyclic piperazinylbenzenesulphonamides are potent and selective 5-HT6 receptor antagonists. Bioorg Med Chem Lett12:1357-60 (2002) 5-hydroxytryptamine receptor 1F
Name:5-hydroxytryptamine receptor 1F
Type:Enzyme Catalytic Domain
Mol. Mass.:41724.68
Organism:Homo sapiens (Human)
Description:5-HT1F HTR1F HUMAN::P30939
Residue:366
BDBM50001824
NameBDBM50001824
Synonyms:CHEMBL282971
TypeSmall organic molecule
Emp. Form.C23H26ClN3O3S2
Mol. Mass.492.054
SMILES[H][C@]12CCCN1CCN(C2)c1cc(NS(=O)(=O)c2sc3ccc(Cl)cc3c2C)ccc1OC