Reaction Details
TargetSubstance-P receptor
LigandBDBM50220508
Substrate/Competitorn/a
Meas. Tech.ChEMBL_205898 (CHEMBL814482)
Ki 132±n/a nM
Citation Bleicher, KHWüthrich, YDe Boni, MKolczewski, SHoffmann, TSleight, AJ Parallel solution- and solid-phase synthesis of spirohydantoin derivatives as neurokinin-1 receptor ligands. Bioorg Med Chem Lett12:2519-22 (2002) Substance-P receptor
Name:Substance-P receptor
Type:G Protein-Coupled Receptor (GPCR)
Mol. Mass.:46254.43
Organism:Homo sapiens (Human)
Description:P25103
Residue:407
BDBM50220508
NameBDBM50220508
Synonyms:CHEMBL313590
TypeSmall organic molecule
Emp. Form.C23H19F6N3O3S
Mol. Mass.531.471
SMILESCSc1ccc(cc1)N1C(=O)NC2(CCN(CC2)C(=O)c2cc(cc(c2)C(F)(F)F)C(F)(F)F)C1=O