Reaction Details
TargetSubstance-P receptor
LigandBDBM50220511
Substrate/Competitorn/a
Meas. Tech.ChEMBL_205898 (CHEMBL814482)
Ki 339±n/a nM
Citation Bleicher, KHWüthrich, YDe Boni, MKolczewski, SHoffmann, TSleight, AJ Parallel solution- and solid-phase synthesis of spirohydantoin derivatives as neurokinin-1 receptor ligands. Bioorg Med Chem Lett12:2519-22 (2002) Substance-P receptor
Name:Substance-P receptor
Type:G Protein-Coupled Receptor (GPCR)
Mol. Mass.:46254.43
Organism:Homo sapiens (Human)
Description:P25103
Residue:407
BDBM50220511
NameBDBM50220511
Synonyms:CHEMBL314499
TypeSmall organic molecule
Emp. Form.C26H19F6N3O3
Mol. Mass.535.4378
SMILESFC(F)(F)c1cc(cc(c1)C(F)(F)F)N1C(=O)NC2(CCN(CC2)C(=O)c2cccc3ccccc23)C1=O