Reaction Details
TargetSubstance-P receptor
LigandBDBM50220517
Substrate/Competitorn/a
Meas. Tech.ChEMBL_205898 (CHEMBL814482)
Ki 107±n/a nM
Citation Bleicher, KHWüthrich, YDe Boni, MKolczewski, SHoffmann, TSleight, AJ Parallel solution- and solid-phase synthesis of spirohydantoin derivatives as neurokinin-1 receptor ligands. Bioorg Med Chem Lett12:2519-22 (2002) Substance-P receptor
Name:Substance-P receptor
Type:G Protein-Coupled Receptor (GPCR)
Mol. Mass.:46254.43
Organism:Homo sapiens (Human)
Description:P25103
Residue:407
BDBM50220517
NameBDBM50220517
Synonyms:CHEMBL310521
TypeSmall organic molecule
Emp. Form.C24H20F6N4O2
Mol. Mass.510.4316
SMILESFC(F)(F)c1cc(CN2C(=O)NC3(CCN(Cc4cccc(c4)C#N)CC3)C2=O)cc(c1)C(F)(F)F