Reaction Details
TargetSubstance-P receptor
LigandBDBM50220519
Substrate/Competitorn/a
Meas. Tech.ChEMBL_205898 (CHEMBL814482)
Ki 3715±n/a nM
Citation Bleicher, KHWüthrich, YDe Boni, MKolczewski, SHoffmann, TSleight, AJ Parallel solution- and solid-phase synthesis of spirohydantoin derivatives as neurokinin-1 receptor ligands. Bioorg Med Chem Lett12:2519-22 (2002) Substance-P receptor
Name:Substance-P receptor
Type:G Protein-Coupled Receptor (GPCR)
Mol. Mass.:46254.43
Organism:Homo sapiens (Human)
Description:P25103
Residue:407
BDBM50220519
NameBDBM50220519
Synonyms:CHEMBL82552
TypeSmall organic molecule
Emp. Form.C31H34F6N4O3
Mol. Mass.624.6171
SMILESCN1C(=O)N(Cc2cc(cc(c2)C(F)(F)F)C(F)(F)F)C2(CCN(CC2)C(=O)CN2CCC(Cc3ccccc3)CC2)C1=O