Reaction Details
TargetSubstance-P receptor
LigandBDBM50217050
Substrate/Competitorn/a
Meas. Tech.ChEMBL_205899 (CHEMBL814483)
Ki 5.1±n/a nM
Citation Bleicher, KHWüthrich, YAdam, GHoffmann, TSleight, AJ Parallel solution- and solid-phase synthesis of spiropyrrolo-pyrroles as novel neurokinin receptor ligands. Bioorg Med Chem Lett12:3073-6 (2002) Substance-P receptor
Name:Substance-P receptor
Type:G Protein-Coupled Receptor (GPCR)
Mol. Mass.:46254.43
Organism:Homo sapiens (Human)
Description:P25103
Residue:407
BDBM50217050
NameBDBM50217050
Synonyms:CHEMBL322885
TypeSmall organic molecule
Emp. Form.C26H23F6N3O5S
Mol. Mass.603.533
SMILESCS(=O)(=O)N1CC2C(C(=O)N(C2=O)c2ccccc2)C11CCN(CC1)C(=O)c1cc(cc(c1)C(F)(F)F)C(F)(F)F