Reaction Details
TargetSubstance-P receptor
LigandBDBM50217089
Substrate/Competitorn/a
Meas. Tech.ChEMBL_205899 (CHEMBL814483)
Ki 513±n/a nM
Citation Bleicher, KHWüthrich, YAdam, GHoffmann, TSleight, AJ Parallel solution- and solid-phase synthesis of spiropyrrolo-pyrroles as novel neurokinin receptor ligands. Bioorg Med Chem Lett12:3073-6 (2002) Substance-P receptor
Name:Substance-P receptor
Type:G Protein-Coupled Receptor (GPCR)
Mol. Mass.:46254.43
Organism:Homo sapiens (Human)
Description:P25103
Residue:407
BDBM50217089
NameBDBM50217089
Synonyms:CHEMBL317209
TypeSmall organic molecule
Emp. Form.C25H23F6N3O3S
Mol. Mass.559.524
SMILESCN1C(=O)C2CN(Cc3cccs3)C3(CCN(CC3)C(=O)c3cc(cc(c3)C(F)(F)F)C(F)(F)F)C2C1=O