Reaction Details
TargetIsoleucyl-tRNA synthetase
LigandBDBM50217838
Substrate/Competitorn/a
Meas. Tech.ChEMBL_88825 (CHEMBL698880)
IC50<1730±n/a nM
Citation Shimizu, TUsui, TMachida, KFuruya, KOsada, HNakata, T Chemical modification of reveromycin A and its biological activities. Bioorg Med Chem Lett12:3363-6 (2002) Isoleucyl-tRNA synthetase
Name:Isoleucyl-tRNA synthetase
Synonyms:n/a
Type:PROTEIN
Mol. Mass.:5742.00
Organism:Rattus norvegicus
Description:ChEMBL_88824
Residue:50
BDBM50217838
NameBDBM50217838
Synonyms:CHEMBL115939
TypeSmall organic molecule
Emp. Form.C33H50O8
Mol. Mass.574.7453
SMILES[H][C@]1(C\C=C(/C)\C=C\[C@H](O)[C@@H](C)\C=C\C(O)=O)O[C@@]2(CC[C@@](CCCC)(O2)[C@@H](OC)\C=C\C(\C)=C\C(O)=O)CC[C@@H]1C