Reaction Details
TargetAlpha-1A/Alpha-1B/Alpha-1D adrenergic receptor
LigandBDBM50109286
Substrate/Competitorn/a
Meas. Tech.ChEMBL_34452 (CHEMBL651984)
Ki 115±n/a nM
Citation Betti, LBotta, MCorelli, FFloridi, MFossa, PGiannaccini, GManetti, FStrappaghetti, GCorsano, S alpha(1)-Adrenoceptor antagonists. Rational design, synthesis and biological evaluation of new trazodone-like compounds. Bioorg Med Chem Lett12:437-40 (2002) Alpha-1A/Alpha-1B/Alpha-1D adrenergic receptor
Name:Alpha-1A/Alpha-1B/Alpha-1D adrenergic receptor
Type:n/a
Mol. Mass.:n/a
Description:ASSAY_ID of EBI is 303470
Components:This complex has 3 components.
Component 1
Name:Alpha-1B adrenergic receptor
Synonyms:ADA1B_RAT Alpha 1B-adrenoceptor Alpha adrenergic receptor 1A and 1B Alpha-1Adrenoceptor Alpha-1B adrenoreceptor | adrenergic Alpha1B
Type:G Protein-Coupled Receptor (GPCR)
Mol. Mass.:56606.71
Organism:Rattus norvegicus (rat)
Description:Receptor binding assays were performed using rat cortical membranes.
Residue:515
Component 2
Name:Alpha-1A adrenergic receptor
Synonyms:ADA1A_RAT Adra1c Alpha-1A adrenoceptor Alpha-1C adrenergic receptor | adrenergic Alpha1A
Type:Protein
Mol. Mass.:51620.15
Organism:Rattus norvegicus (Rat)
Description:P43140
Residue:466
Component 3
Name:Alpha-1D adrenergic receptor
Synonyms:ADA1D_RAT Adra1d Alpha-1D adrenergic receptor | Serotonin 1a (5-HT1a) receptor/Adrenergic receptor alpha-1
Type:Protein
Mol. Mass.:59375.97
Organism:Rattus norvegicus (Rat)
Description:P23944
Residue:561
BDBM50109286
NameBDBM50109286
Synonyms:6-(1H-imidazol-1-yl)-2-(3-(4-(2-methoxyphenyl)piperazin-1-yl)propyl)pyridazin-3(2H)-one CHEMBL420542
TypeSmall organic molecule
Emp. Form.C21H26N6O2
Mol. Mass.394.4701
SMILESCOc1ccccc1N1CCN(CCCn2nc(ccc2=O)-n2ccnc2)CC1