Reaction Details
TargetCorticotropin-releasing factor receptor 1/2
LigandBDBM50219970
Substrate/Competitorn/a
Meas. Tech.ChEMBL_50968 (CHEMBL666049)
Ki 1.3±n/a nM
Citation Arvanitis, AGRescinito, JTArnold, CRWilde, RGCain, GASun, JHYan, JSTeleha, CAFitzgerald, LWMcElroy, JZaczek, RHartig, PRGrossman, SArneric, SPGilligan, PJOlson, RERobertson, DW Imidazo[4,5-b]pyridines as corticotropin releasing factor receptor ligands. Bioorg Med Chem Lett13:125-8 (2003) Corticotropin-releasing factor receptor 1/2
Name:Corticotropin-releasing factor receptor 1/2
Synonyms:Corticotropin releasing factor receptor
Type:n/a
Mol. Mass.:n/a
Description:ASSAY_ID of ChEMBL is 217368
Components:This complex has 2 components.
Component 1
Name:Corticotropin-releasing factor receptor 1
Type:G Protein-Coupled Receptor (GPCR)
Mol. Mass.:47870.75
Organism:Rattus norvegicus (rat)
Description:Receptor binding assays were performed using rat cortex homogenate.
Residue:415
Component 2
Name:Corticotropin-releasing factor receptor 2
Synonyms:CRF-R-2 CRF2 Beta CRFR2_RAT CRH-R2 Corticotropin-releasing factor receptor 2 Crf2r | Crhr2
Type:Enzyme Catalytic Domain
Mol. Mass.:47697.09
Organism:RAT
Description:CRF2 Beta 0 RAT::P47866
Residue:411
BDBM50219970
NameBDBM50219970
Synonyms:CHEMBL23950
TypeSmall organic molecule
Emp. Form.C18H19Cl2N3
Mol. Mass.348.27
SMILESCCC(C)n1c(CC)nc2c(ccnc12)-c1ccc(Cl)cc1Cl