Reaction Details
TargetCorticotropin-releasing factor receptor 1/2
LigandBDBM50220483
Substrate/Competitorn/a
Meas. Tech.ChEMBL_50970 (CHEMBL666051)
Ki 1.8±n/a nM
Citation Arvanitis, AGRescinito, JTArnold, CRWilde, RGFitzgerald, LWZaczek, RHartig, PRGrossman, SArneric, SPGilligan, PJOlson, RERobertson, DW Imidazo[4,5-c]pyridines as corticotropin releasing factor receptor ligands. Bioorg Med Chem Lett13:129-31 (2003) Corticotropin-releasing factor receptor 1/2
Name:Corticotropin-releasing factor receptor 1/2
Synonyms:Corticotropin releasing factor receptor
Type:n/a
Mol. Mass.:n/a
Description:ASSAY_ID of ChEMBL is 217368
Components:This complex has 2 components.
Component 1
Name:Corticotropin-releasing factor receptor 1
Type:G Protein-Coupled Receptor (GPCR)
Mol. Mass.:47870.75
Organism:Rattus norvegicus (rat)
Description:Receptor binding assays were performed using rat cortex homogenate.
Residue:415
Component 2
Name:Corticotropin-releasing factor receptor 2
Synonyms:CRF-R-2 CRF2 Beta CRFR2_RAT CRH-R2 Corticotropin-releasing factor receptor 2 Crf2r | Crhr2
Type:Enzyme Catalytic Domain
Mol. Mass.:47697.09
Organism:RAT
Description:CRF2 Beta 0 RAT::P47866
Residue:411
BDBM50220483
NameBDBM50220483
Synonyms:CHEMBL22213
TypeSmall organic molecule
Emp. Form.C21H20ClF3N4
Mol. Mass.420.859
SMILESCCc1nc2c(ncnc2n1C(C1CC1)C1CC1)-c1ccc(cc1Cl)C(F)(F)F