Reaction Details
TargetInosine-5'-monophosphate dehydrogenase 1/2
LigandBDBM23300
Substrate/Competitorn/a
Meas. Tech.ChEMBL_88591 (CHEMBL699983)
IC50 168000±n/a nM
Citation Pickett, SDSherborne, BSWilkinson, TBennett, JBorkakoti, NBroadhurst, MHurst, DKilford, IMcKinnell, MJones, PS Discovery of novel low molecular weight inhibitors of IMPDH via virtual needle screening. Bioorg Med Chem Lett13:1691-4 (2003) Inosine-5'-monophosphate dehydrogenase 1/2
Name:Inosine-5'-monophosphate dehydrogenase 1/2
Type:n/a
Mol. Mass.:n/a
Description:ASSAY_ID of ChEMBL is 88591
Components:This complex has 2 components.
Component 1
Name:Inosine-5'-monophosphate dehydrogenase 2
Synonyms:IMDH2_HUMAN IMPD 2 IMPDH-II Inosine 5'-monophosphate dehydrogenase II (IMPDH II) Inosine-5 -monophosphate dehydrogenase 2 | Inosine-5'-monophosphate dehydrogenase (IMPDH)
Type:Enzyme
Mol. Mass.:55806.87
Organism:Homo sapiens (Human)
Description:Recombinant IMPDH2 expressed in E. coli.
Residue:514
Component 2
Name:Inosine-5'-monophosphate dehydrogenase 1
Synonyms:IMDH1_HUMAN IMPD 1 IMPDH-I Inosine Monophosphate Dehydrogenase Type 1 (IMPDH1) | Inosine-5'-monophosphate dehydrogenase (IMPDH)
Type:Enzyme
Mol. Mass.:55407.70
Organism:Homo sapiens (Human)
Description:Recombinant IMPDH1 expressed in E. coli.
Residue:514
BDBM23300
NameBDBM23300
Synonyms:4-amino-7-chloroquinoline (ACQ)-based compound, 5 CHEMBL44789
TypeSmall organic molecule
Emp. Form.C9H7ClN2
Mol. Mass.178.618
SMILESNc1ccnc2cc(Cl)ccc12