Reaction Details
TargetAlpha-1B adrenergic receptor
LigandBDBM50220746
Substrate/Competitorn/a
Meas. Tech.ChEMBL_34616 (CHEMBL645574)
Ki 16±n/a nM
Citation Lopez, FJArias, LChan, RClarke, DEElworthy, TRFord, APGuzman, AJaime-Figueroa, SJasper, JRMorgans, DJPadilla, FPerez-Medrano, AQuintero, CRomero, MSandoval, LSmith, SAWilliams, TJBlue, DR Synthesis, pharmacology and pharmacokinetics of 3-(4-aryl-piperazin-1-ylalkyl)-uracils as uroselective alpha1A-antagonists. Bioorg Med Chem Lett13:1873-8 (2003) Alpha-1B adrenergic receptor
Name:Alpha-1B adrenergic receptor
Type:Enzyme
Mol. Mass.:56862.13
Organism:Homo sapiens (Human)
Description:P35368
Residue:520
BDBM50220746
NameBDBM50220746
Synonyms:CHEMBL292189
TypeSmall organic molecule
Emp. Form.C21H27F3N4O3
Mol. Mass.440.4593
SMILESCc1[nH]c(=O)n(CCCN2CCN(CC2)c2ccccc2OCC(F)(F)F)c(=O)c1C